{"text_format":"1","workbook":"xlsx","n_sheets":4,"sheets":["講習会情報 ","演題","CC","Sheet1"],"not_rendered":{"charts":0,"images":16,"macros":1,"external_links":0,"defined_names":0,"comments":0,"pivot_tables":0},"unopened":[],"bounds":{"document_bytes":16777216,"sheet_cells":100000,"rows_first":2000,"rows_last":500,"rows_between":2000,"halvings":0,"cell_chars":16384,"cell_head_chars":4096},"cells_cut":0,"cells_raw":0,"read":"whole","date_system":"1900"}

{"sheet":"講習会情報 ","index":0,"n_rows":32,"n_cols":22,"rows_kept":32,"cut":false,"hidden":false,"merged":[[30,1,30,2],[25,8,25,20],[2,18,2,19],[2,15,2,16],[2,12,2,13],[6,9,6,10],[7,9,7,10],[6,11,6,20],[7,11,7,20],[21,1,21,2],[21,8,21,9],[21,10,21,20],[24,4,24,20],[19,4,19,5],[19,7,19,8],[20,1,20,2],[31,1,31,2],[31,19,31,20],[27,13,27,20],[26,4,26,20],[27,4,27,5],[27,7,27,8],[27,10,27,12],[28,4,28,5],[28,7,28,8],[28,10,28,12],[28,13,28,20],[30,10,30,15],[30,16,30,19],[29,4,29,20],[23,0,29,1],[23,4,23,20],[20,10,20,20],[22,8,22,10],[22,12,22,20],[22,1,22,2],[15,4,15,20],[16,4,16,20],[17,5,17,7],[17,8,17,20],[10,4,10,20],[12,1,12,2],[12,8,12,9],[12,10,12,20],[13,1,13,2],[13,8,13,9],[31,15,31,16],[0,0,0,21],[1,0,1,21],[5,9,5,12],[5,13,5,19],[25,5,25,7],[11,1,11,2],[11,4,11,20],[14,1,14,2],[15,0,19,1],[14,9,14,20],[18,4,18,20],[19,10,19,12],[13,10,13,20],[9,4,9,5],[10,1,10,2]]}
["各種関係団体主催の講演会・講習会等認定申請書"]
[]
[null,null,null,null,null,null,null,null,null,null,null,null,null,null,"年",null,null,"月",null,null,"日"]
[null,"　東 京 都 医 師 会 長　殿"]
[]
[null,null,null,null,null,null,null,null,null,"申請者医師氏名："]
[null,null,null,null,null,null,null,null,null,"所属："]
[null,null,null,null,null,null,null,null,null,"役職："]
["１．講習会等情報"]
[null,"開催日時",null,null,null,null,"年",null,"月",null,"日","（",null,"）",null,"：",null,"～",null,"："]
[null,"講習会名"]
[null,"主催者"]
[null,"共催者有無",null,null,null,null,null,null,"共催者名:"]
[null,"企業共催有無",null,null,null,null,null,null,"企業名："]
[null,"講習会等の形式別",null,null,null,null,null,null,"（",null,null,null,null,null,null,null,null,null,null,null,null,"）"]
["開催場所",null,"会場名"]
[null,null,"階・室名"]
[null,null,"郵便番号",null,"〒"]
[null,null,"住所"]
[null,null,"電話番号",null,null,null,"－",null,null,"－"]
[null,"対象者",null,null,null,null,null,null,null,"（",null,null,null,null,null,null,null,null,null,null,null,"）"]
[null,"参加費",null,null,null,null,null,null,"…内容（",null,null,null,null,null,null,null,null,null,null,null,null,"）"]
[null,"事前申込み",null,null,null,null,null,null,"…申込締切日",null,null,"（",null,null,null,null,null,null,null,null,null,"）"]
["連絡・問合せ先",null,"団体・会社名等"]
[null,null,"担当者名"]
[null,null,"郵便番号",null,"〒"]
[null,null,"住所"]
[null,null,"電話番号",null,null,null,"－",null,null,"－"]
[null,null,"ＦＡＸ",null,null,null,"－",null,null,"－"]
[null,null,"メールアドレス"]
[null,"ＣＯＩ開示有無",null,null,null,null,null,null,null,null,"参加予定者数",null,null,null,null,null,null,null,null,null,"人"]
[null,"受付管理",null,null,null,null,null,null,null,null,null,null,null,null,"…",null,null,"分間"]

{"sheet":"演題","index":1,"n_rows":40,"n_cols":20,"rows_kept":40,"cut":false,"hidden":false,"merged":[[16,9,16,10],[15,12,15,13],[16,12,16,13],[14,12,14,13],[25,9,25,10],[6,4,6,8],[27,1,27,2],[27,4,27,20],[25,12,25,13],[26,12,26,13],[12,1,16,2],[17,1,17,2],[18,4,18,20],[19,4,19,20],[23,12,23,13],[24,12,24,13],[17,4,17,20],[22,1,26,2],[22,7,22,8],[12,4,12,6],[12,7,12,8],[9,4,9,20],[13,12,13,13],[5,9,5,10],[7,1,7,2],[7,4,7,20],[8,4,8,20],[2,1,6,2],[2,7,2,8],[2,4,2,6],[3,4,3,8],[3,9,3,10],[6,12,6,13],[3,12,3,13],[6,9,6,10],[4,4,4,8],[5,4,5,8],[37,1,37,2],[37,4,37,20],[38,4,38,20],[32,1,36,2],[32,4,32,6],[32,7,32,8],[33,4,33,8],[33,9,33,10],[33,12,33,13],[34,9,34,10],[34,4,34,8],[35,4,35,8],[34,12,34,13],[35,9,35,10],[35,12,35,13],[39,4,39,20],[8,0,9,1],[18,0,19,1],[28,0,29,1],[38,0,39,1],[24,4,24,8],[25,4,25,8],[26,4,26,8],[36,9,36,10],[36,12,36,13],[36,4,36,8],[14,4,14,8],[15,4,15,8],[16,4,16,8],[22,4,22,6],[28,4,28,20],[29,4,29,20],[1,4,1,5],[11,4,11,5],[21,4,21,5],[31,4,31,5],[13,4,13,8],[4,9,4,10],[23,4,23,8],[26,9,26,10],[24,9,24,10],[23,9,23,10],[13,9,13,10],[14,9,14,10],[4,12,4,13],[5,12,5,13],[15,9,15,10],[6,16,6,21],[5,16,5,21],[4,16,4,21],[3,16,3,21],[36,16,36,21],[35,16,35,21],[34,16,34,21],[33,16,33,21],[26,16,26,21],[25,16,25,21],[24,16,24,21],[23,16,23,21],[16,16,16,21],[15,16,15,21],[14,16,14,21],[13,16,13,21]]}
["２．演題（演題ごとにご記入ください）"]
[null,"講演日時",null,null,null,null,"年",null,"月",null,"日","（",null,"）",null,"：",null,"～",null,"："]
[null,"カリキュラムコード\n単位",null,null,"単位合計：",null,null,{"$f":"SUM(M4:N7)","v":0},null,"単位"]
[null,null,null,null,"カリキュラムコード:",null,null,null,null,null,null,"（",null,null,"単位","）",{"$f":"IF(J4=\"\",\"\",VLOOKUP(J4,CC!A:B,2,0))","v":""}]
[null,null,null,null,"カリキュラムコード:",null,null,null,null,null,null,"（",null,null,"単位","）",{"$f":"IF(J5=\"\",\"\",VLOOKUP(J5,CC!A:B,2,0))","v":""}]
[null,null,null,null,"カリキュラムコード:",null,null,null,null,null,null,"（",null,null,"単位","）",{"$f":"IF(J6=\"\",\"\",VLOOKUP(J6,CC!A:B,2,0))","v":""}]
[null,null,null,null,"カリキュラムコード:",null,null,null,null,null,null,"（",null,null,"単位","）",{"$f":"IF(J7=\"\",\"\",VLOOKUP(J7,CC!A:B,2,0))","v":""}]
[null,"演題名"]
["講師",null,"所属・役職"]
[null,null,"氏名"]
[]
[null,"講演日時",null,null,null,null,"年",null,"月",null,"日","（",null,"）",null,"：",null,"～",null,"："]
[null,"カリキュラムコード\n単位",null,null,"単位合計：",null,null,{"$f":"SUM(M14:N17)","v":0},null,"単位"]
[null,null,null,null,"カリキュラムコード:",null,null,null,null,null,null,"（",null,null,"単位","）",{"$f":"IF(J14=\"\",\"\",VLOOKUP(J14,CC!A:B,2,0))","v":""}]
[null,null,null,null,"カリキュラムコード:",null,null,null,null,null,null,"（",null,null,"単位","）",{"$f":"IF(J15=\"\",\"\",VLOOKUP(J15,CC!A:B,2,0))","v":""}]
[null,null,null,null,"カリキュラムコード:",null,null,null,null,null,null,"（",null,null,"単位","）",{"$f":"IF(J16=\"\",\"\",VLOOKUP(J16,CC!A:B,2,0))","v":""}]
[null,null,null,null,"カリキュラムコード:",null,null,null,null,null,null,"（",null,null,"単位","）",{"$f":"IF(J17=\"\",\"\",VLOOKUP(J17,CC!A:B,2,0))","v":""}]
[null,"演題名"]
["講師",null,"所属・役職"]
[null,null,"氏名"]
[]
[null,"講演日時",null,null,null,null,"年",null,"月",null,"日","（",null,"）",null,"：",null,"～",null,"："]
[null,"カリキュラムコード\n単位",null,null,"単位合計：",null,null,{"$f":"SUM(M24:N27)","v":0},null,"単位"]
[null,null,null,null,"カリキュラムコード:",null,null,null,null,null,null,"（",null,null,"単位","）",{"$f":"IF(J24=\"\",\"\",VLOOKUP(J24,CC!A:B,2,0))","v":""}]
[null,null,null,null,"カリキュラムコード:",null,null,null,null,null,null,"（",null,null,"単位","）",{"$f":"IF(J25=\"\",\"\",VLOOKUP(J25,CC!A:B,2,0))","v":""}]
[null,null,null,null,"カリキュラムコード:",null,null,null,null,null,null,"（",null,null,"単位","）",{"$f":"IF(J26=\"\",\"\",VLOOKUP(J26,CC!A:B,2,0))","v":""}]
[null,null,null,null,"カリキュラムコード:",null,null,null,null,null,null,"（",null,null,"単位","）",{"$f":"IF(J27=\"\",\"\",VLOOKUP(J27,CC!A:B,2,0))","v":""}]
[null,"演題名"]
["講師",null,"所属・役職"]
[null,null,"氏名"]
[]
[null,"講演日時",null,null,null,null,"年",null,"月",null,"日","（",null,"）",null,"：",null,"～",null,"："]
[null,"カリキュラムコード\n単位",null,null,"単位合計：",null,null,{"$f":"SUM(M34:N37)","v":0},null,"単位"]
[null,null,null,null,"カリキュラムコード:",null,null,null,null,null,null,"（",null,null,"単位","）",{"$f":"IF(J34=\"\",\"\",VLOOKUP(J34,CC!A:B,2,0))","v":""}]
[null,null,null,null,"カリキュラムコード:",null,null,null,null,null,null,"（",null,null,"単位","）",{"$f":"IF(J35=\"\",\"\",VLOOKUP(J35,CC!A:B,2,0))","v":""}]
[null,null,null,null,"カリキュラムコード:",null,null,null,null,null,null,"（",null,null,"単位","）",{"$f":"IF(J36=\"\",\"\",VLOOKUP(J36,CC!A:B,2,0))","v":""}]
[null,null,null,null,"カリキュラムコード:",null,null,null,null,null,null,"（",null,null,"単位","）",{"$f":"IF(J37=\"\",\"\",VLOOKUP(J37,CC!A:B,2,0))","v":""}]
[null,"演題名"]
["講師",null,"所属・役職"]
[null,null,"氏名"]

{"sheet":"CC","index":2,"n_rows":88,"n_cols":2,"rows_kept":88,"cut":false,"hidden":false,"merged":[]}
[]
[]
["番号","カリキュラムコード"]
[1,"医師のプロフェッショナリズム"]
[2,"医療倫理：臨床倫理"]
[3,"医療倫理：研究倫理と生命倫理"]
[4,"医師─患者関係とコミュニケーション"]
[5,"心理社会的アプローチ"]
[6,"医療制度と法律"]
[7,"医療の質と安全"]
[8,"感染対策"]
[9,"医療情報"]
[10,"チーム医療"]
[11,"予防と保健"]
[12,"地域医療"]
[13,"医療と介護および福祉の連携"]
[14,"災害医療"]
[15,"臨床問題解決のプロセス"]
[16,"ショック"]
[17,"急性中毒"]
[18,"全身倦怠感"]
[19,"身体機能の低下"]
[20,"不眠（睡眠障害）"]
[21,"食欲不振"]
[22,"体重減少・るい痩"]
[23,"体重増加・肥満"]
[24,"浮腫"]
[25,"リンパ節腫脹"]
[26,"発疹"]
[27,"黄疸"]
[28,"発熱"]
[29,"認知能の障害"]
[30,"頭痛"]
[31,"めまい"]
[32,"意識障害"]
[33,"失神"]
[34,"言語障害"]
[35,"けいれん発作"]
[36,"視力障害、視野狭窄"]
[37,"目の充血"]
[38,"聴覚障害"]
[39,"鼻漏・鼻閉"]
[40,"鼻出血"]
[41,"嗄声"]
[42,"胸痛"]
[43,"動悸"]
[44,"心肺停止"]
[45,"呼吸困難"]
[46,"咳・痰"]
[47,"誤嚥"]
[48,"誤飲"]
[49,"嚥下困難"]
[50,"吐血・下血"]
[51,"嘔気・嘔吐"]
[52,"胸やけ"]
[53,"腹痛"]
[54,"便通異常（下痢、便秘）"]
[55,"肛門・会陰部痛"]
[56,"熱傷"]
[57,"外傷"]
[58,"褥瘡"]
[59,"背部痛"]
[60,"腰痛"]
[61,"関節痛"]
[62,"歩行障害"]
[63,"四肢のしびれ"]
[64,"血尿（肉眼的・顕微鏡的）"]
[65,"排尿障害（尿失禁・排尿困難）"]
[66,"乏尿・尿閉"]
[67,"多尿"]
[68,"精神科領域の救急"]
[69,"不安"]
[70,"気分の障害（うつ）"]
[71,"流・早産および満期産"]
[72,"成長・発達の障害"]
[73,"慢性疾患・複合疾患の管理"]
[74,"高血圧症"]
[75,"脂質異常症"]
[76,"糖尿病"]
[77,"骨粗鬆症"]
[78,"脳血管障害後遺症"]
[79,"気管支喘息・COPD"]
[80,"在宅医療"]
[81,"終末期のケア"]
[82,"生活習慣"]
[83,"相補・代替医療（漢方医療を含む）"]
[0,"最新のトピックス・その他"]
["&''","&''"]

{"sheet":"Sheet1","index":3,"n_rows":0,"n_cols":0,"rows_kept":0,"cut":false,"hidden":false,"merged":[]}